Reaction Details
TargetAldo-keto reductase family 1 member B10
LigandBDBM16314
Substrate/Competitorn/a
Meas. Tech.ChEMBL_466848 (CHEMBL921548)
IC50 12±n/a nM
Citation Gallego, ORuiz, FXArdèvol, ADomínguez, MAlvarez, Rde Lera, ARRovira, CFarrés, JFita, IParés, X Structural basis for the high all-trans-retinaldehyde reductase activity of the tumor marker AKR1B10. Proc Natl Acad Sci U S A104:20764-9 (2007) 
 
Aldo-keto reductase family 1 member B10
Name:Aldo-keto reductase family 1 member B10
Type:Protein
Mol. Mass.:36024.67
Organism:Homo sapiens (Human)
Description:O60218. 1ZUA; 4JII; 4GQ0
Residue:316
BDBM16314
NameBDBM16314
Synonyms:2-{[6-methoxy-5-(trifluoromethyl)naphthalen-1-yl]-N-methylmethanethioamido}acetic acid CHEMBL436 Tolrestat
TypeSmall organic molecule
Emp. Form.C16H14F3NO3S
Mol. Mass.357.347
SMILESCOc1ccc2c(cccc2c1C(F)(F)F)C(=S)N(C)CC(O)=O