Reaction Details
TargetcAMP and cAMP-inhibited cGMP 3',5'-cyclic phosphodiesterase 10A
LigandBDBM14762
Substrate/Competitorn/a
Meas. Tech.ChEMBL_466942 (CHEMBL933707)
Ki 18±n/a nM
Citation Kulkarni, SSPatel, MRTalele, TT CoMFA and HQSAR studies on 6,7-dimethoxy-4-pyrrolidylquinazoline derivatives as phosphodiesterase10A inhibitors. Bioorg Med Chem16:3675-86 (2008) 
 
cAMP and cAMP-inhibited cGMP 3',5'-cyclic phosphodiesterase 10A
Name:cAMP and cAMP-inhibited cGMP 3',5'-cyclic phosphodiesterase 10A
Type:Protein
Mol. Mass.:88412.52
Organism:Homo sapiens (Human)
Description:Q9Y233
Residue:1055
BDBM14762
NameBDBM14762
Synonyms:(R)-6,7-Dimethoxy-4-[3-(6-methoxy-naphthalen-2-yloxy)-pyrrolidin-1-yl]-quinazoline 6,7-dimethoxy-4-[(3R)-3-[(6-methoxynaphthalen-2-yl)oxy]pyrrolidin-1-yl]quinazoline
TypeSmall organic molecule
Emp. Form.C25H25N3O4
Mol. Mass.431.4837
SMILESCOc1ccc2cc(O[C@@H]3CCN(C3)c3ncnc4cc(OC)c(OC)cc34)ccc2c1