Reaction Details
TargetcAMP and cAMP-inhibited cGMP 3',5'-cyclic phosphodiesterase 10A
LigandBDBM14757
Substrate/Competitorn/a
Meas. Tech.ChEMBL_466942 (CHEMBL933707)
Ki 123±n/a nM
Citation Kulkarni, SSPatel, MRTalele, TT CoMFA and HQSAR studies on 6,7-dimethoxy-4-pyrrolidylquinazoline derivatives as phosphodiesterase10A inhibitors. Bioorg Med Chem16:3675-86 (2008) 
 
cAMP and cAMP-inhibited cGMP 3',5'-cyclic phosphodiesterase 10A
Name:cAMP and cAMP-inhibited cGMP 3',5'-cyclic phosphodiesterase 10A
Type:Protein
Mol. Mass.:88412.52
Organism:Homo sapiens (Human)
Description:Q9Y233
Residue:1055
BDBM14757
NameBDBM14757
Synonyms:(R)-6,7-Dimethoxy-4-[3-(pyridin-2-yloxy)-pyrrolidin-1-yl]-quinazoline 6,7-dimethoxy-4-[(3R)-3-(pyridin-2-yloxy)pyrrolidin-1-yl]quinazoline
TypeSmall organic molecule
Emp. Form.C19H20N4O3
Mol. Mass.352.3871
SMILESCOc1cc2ncnc(N3CC[C@H](C3)Oc3ccccn3)c2cc1OC