Reaction Details
TargetTyrosine-protein phosphatase non-receptor type 1
LigandBDBM50373455
Substrate/Competitorn/a
Meas. Tech.ChEMBL_467822 (CHEMBL936456)
Ki 179000±n/a nM
Citation Han, YBelley, MBayly, CIColucci, JDufresne, CGiroux, ALau, CKLeblanc, YMcKay, DTherien, MWilson, MCSkorey, KChan, CCScapin, GKennedy, BP Discovery of [(3-bromo-7-cyano-2-naphthyl)(difluoro)methyl]phosphonic acid, a potent and orally active small molecule PTP1B inhibitor. Bioorg Med Chem Lett18:3200-5 (2008) 
 
Tyrosine-protein phosphatase non-receptor type 1
Name:Tyrosine-protein phosphatase non-receptor type 1
Type:Protein phosphatase
Mol. Mass.:49963.76
Organism:Homo sapiens (Human)
Description:Human recombinant GST-fusion PTP1B (1-435).
Residue:435
BDBM50373455
NameBDBM50373455
Synonyms:CHEMBL261107
TypeSmall organic molecule
Emp. Form.C11H8BrF2O3P
Mol. Mass.337.054
SMILESOP(O)(=O)C(F)(F)c1cc2ccccc2cc1Br