Reaction Details
TargetHistone deacetylase 1
LigandBDBM50373681
Substrate/Competitorn/a
Meas. Tech.ChEMBL_468074 (CHEMBL931658)
IC50 30±n/a nM
Citation Paquin, IRaeppel, SLeit, SGaudette, FZhou, NMoradei, OSaavedra, OBernstein, NRaeppel, FBouchain, GFréchette, SWoo, SHVaisburg, AFournel, MKalita, ARobert, MFLu, ATrachy-Bourget, MCYan, PTLiu, JRahil, JMacLeod, ARBesterman, JMLi, ZDelorme, D Design and synthesis of 4-[(s-triazin-2-ylamino)methyl]-N-(2-aminophenyl)-benzamides and their analogues as a novel class of histone deacetylase inhibitors. Bioorg Med Chem Lett18:1067-71 (2008) 
 
Histone deacetylase 1
Name:Histone deacetylase 1
Type:Enzyme
Mol. Mass.:55090.27
Organism:Homo sapiens (Human)
Description:Q13547
Residue:482
BDBM50373681
NameBDBM50373681
Synonyms:CHEMBL257631
TypeSmall organic molecule
Emp. Form.C29H30N8O
Mol. Mass.506.6015
SMILESNc1ccccc1NC(=O)c1ccc(CNc2nc(NC3CC3)nc(NC3Cc4ccccc4C3)n2)cc1