Reaction Details
TargetHistone deacetylase 1
LigandBDBM50373684
Substrate/Competitorn/a
Meas. Tech.ChEMBL_468074 (CHEMBL931658)
IC50 100±n/a nM
Citation Paquin, IRaeppel, SLeit, SGaudette, FZhou, NMoradei, OSaavedra, OBernstein, NRaeppel, FBouchain, GFréchette, SWoo, SHVaisburg, AFournel, MKalita, ARobert, MFLu, ATrachy-Bourget, MCYan, PTLiu, JRahil, JMacLeod, ARBesterman, JMLi, ZDelorme, D Design and synthesis of 4-[(s-triazin-2-ylamino)methyl]-N-(2-aminophenyl)-benzamides and their analogues as a novel class of histone deacetylase inhibitors. Bioorg Med Chem Lett18:1067-71 (2008) 
 
Histone deacetylase 1
Name:Histone deacetylase 1
Type:Enzyme
Mol. Mass.:55090.27
Organism:Homo sapiens (Human)
Description:Q13547
Residue:482
BDBM50373684
NameBDBM50373684
Synonyms:CHEMBL403285
TypeSmall organic molecule
Emp. Form.C25H26N8O
Mol. Mass.454.5269
SMILESNc1nc(NCCc2ccccc2)nc(NCc2ccc(cc2)C(=O)Nc2ccccc2N)n1