Reaction Details
TargetD(3) dopamine receptor
LigandBDBM50373714
Substrate/Competitorn/a
Meas. Tech.ChEMBL_468371 (CHEMBL931955)
Ki 330±n/a nM
Citation Tietze, RLöber, SHübner, HGmeiner, PKuwert, TPrante, O Discovery of a dopamine D4 selective PET ligand candidate taking advantage of a click chemistry based REM linker. Bioorg Med Chem Lett18:983-8 (2008) 
 
D(3) dopamine receptor
Name:D(3) dopamine receptor
Type:n/a
Mol. Mass.:44243.43
Organism:Homo sapiens (Human)
Description:n/a
Residue:400
BDBM50373714
NameBDBM50373714
Synonyms:CHEMBL270406
TypeSmall organic molecule
Emp. Form.C22H29FN2O4
Mol. Mass.404.4751
SMILESCOc1cc(CN2CCN(CC2)c2ccccc2OC)c(OCCF)cc1OC