Reaction Details
TargetCalcitonin gene-related peptide type 1 receptor
LigandBDBM50373770
Substrate/Competitorn/a
Meas. Tech.ChEMBL_468527 (CHEMBL932962)
Ki 54±n/a nM
Citation Nguyen, DNPaone, DVShaw, AWBurgey, CSMosser, SDJohnston, VSalvatore, CALeonard, YMMiller-Stein, CMKane, SAKoblan, KSVacca, JPGraham, SLWilliams, TM Calcitonin gene-related peptide (CGRP) receptor antagonists: investigations of a pyridinone template. Bioorg Med Chem Lett18:755-8 (2008) 
 
Calcitonin gene-related peptide type 1 receptor
Name:Calcitonin gene-related peptide type 1 receptor
Type:Enzyme Catalytic Domain
Mol. Mass.:52980.45
Organism:Homo sapiens (Human)
Description:Q16602
Residue:461
BDBM50373770
NameBDBM50373770
Synonyms:CHEMBL428247
TypeSmall organic molecule
Emp. Form.C25H22F4N6O3
Mol. Mass.530.4742
SMILESFc1ccccc1-c1cc(NC(=O)N2CCC(CC2)n2c3cccnc3[nH]c2=O)c(=O)n(CC(F)(F)F)c1