Reaction Details
TargetMuscarinic acetylcholine receptor M4
LigandBDBM50231845
Substrate/Competitorn/a
Meas. Tech.ChEMBL_468561 (CHEMBL932108)
Ki 445.1±n/a nM
Citation Lewis, LMSheffler, DWilliams, RBridges, TMKennedy, JPBrogan, JTMulder, MJWilliams, LNalywajko, NTNiswender, CMWeaver, CDConn, PJLindsley, CW Synthesis and SAR of selective muscarinic acetylcholine receptor subtype 1 (M1 mAChR) antagonists. Bioorg Med Chem Lett18:885-90 (2008) 
 
Muscarinic acetylcholine receptor M4
Name:Muscarinic acetylcholine receptor M4
Type:Enzyme Catalytic Domain
Mol. Mass.:52841.70
Organism:RAT
Description:Cholinergic, muscarinic M4 CHRM4 RAT::P08485
Residue:477
BDBM50231845
NameBDBM50231845
Synonyms:CHEMBL255523 | N-(3-chloro-4-(4-ethylpiperazin-1-yl)phenyl)-3-cyclopentylpropanamide
TypeSmall organic molecule
Emp. Form.C20H30ClN3O
Mol. Mass.363.925
SMILESCCN1CCN(CC1)c1ccc(NC(=O)CCC2CCCC2)cc1Cl