Reaction Details
TargetProtein-arginine deiminase type-4
LigandBDBM50366387
Substrate/Competitorn/a
Meas. Tech.ChEMBL_468733 (CHEMBL929915)
Ki 560000±n/a nM
Citation Knuckley, BLuo, YThompson, PR Profiling Protein Arginine Deiminase 4 (PAD4): a novel screen to identify PAD4 inhibitors. Bioorg Med Chem16:739-45 (2008) 
 
Protein-arginine deiminase type-4
Name:Protein-arginine deiminase type-4
Type:Enzyme Catalytic Domain
Mol. Mass.:74078.90
Organism:Homo sapiens (Human)
Description:gi_216548487
Residue:663
BDBM50366387
NameBDBM50366387
Synonyms:STREPTOMYCIN
TypeSmall organic molecule
Emp. Form.C21H39N7O12
Mol. Mass.581.5741
SMILES[#6]-[#7]-[#6@H]-1-[#6@H](-[#8])-[#6@@H](-[#8])-[#6@H](-[#6]-[#8])-[#8]-[#6@H]-1-[#8]-[#6@H]1-[#6@H](-[#8]-[#6@@H]-2-[#6@@H](-[#8])-[#6@H](-[#8])-[#6@@H](\[#7]=[#6](/[#7])-[#7])-[#6@H](-[#8])-[#6@H]-2\[#7]=[#6](/[#7])-[#7])-[#8]-[#6@@H](-[#6])[C@]1([#8])[#6]=O