Reaction Details
TargetProtein-arginine deiminase type-4
LigandBDBM50422012
Substrate/Competitorn/a
Meas. Tech.ChEMBL_468732 (CHEMBL929914)
IC50 620000±n/a nM
Citation Knuckley, BLuo, YThompson, PR Profiling Protein Arginine Deiminase 4 (PAD4): a novel screen to identify PAD4 inhibitors. Bioorg Med Chem16:739-45 (2008) 
 
Protein-arginine deiminase type-4
Name:Protein-arginine deiminase type-4
Type:Enzyme Catalytic Domain
Mol. Mass.:74078.90
Organism:Homo sapiens (Human)
Description:gi_216548487
Residue:663
BDBM50422012
NameBDBM50422012
Synonyms:Klinomycin Minocin | Vectrin
TypeSmall organic molecule
Emp. Form.C23H27N3O7
Mol. Mass.457.4764
SMILESCN(C)[C@H]1[C@@H]2C[C@@H]3Cc4c(ccc(O)c4C(=O)C3C(=O)[C@]2(O)C(=O)C(C(N)=O)C1=O)N(C)C