Reaction Details
TargetSucrase-isomaltase, intestinal
LigandBDBM50031472
Substrate/Competitorn/a
Meas. Tech.ChEMBL_468810 (CHEMBL932050)
IC50>500000±n/a nM
Citation Gao, HKawabata, J 2-Aminoresorcinol is a potent alpha-glucosidase inhibitor. Bioorg Med Chem Lett18:812-5 (2008) 
 
Sucrase-isomaltase, intestinal
Name:Sucrase-isomaltase, intestinal
Type:Enzyme
Mol. Mass.:210329.04
Organism:Rattus norvegicus (Rat)
Description:P23739
Residue:1841
BDBM50031472
NameBDBM50031472
Synonyms:1,2,3-Trihydroxybenzene, XIV Pyrogallol (10) pyrogallol
TypeSmall organic molecule
Emp. Form.C6H6O3
Mol. Mass.126.11
SMILESOc1cccc(O)c1O