Reaction Details
TargetMuscarinic acetylcholine receptor M5
LigandBDBM50165008
Substrate/Competitorn/a
Meas. Tech.ChEMBL_468833 (CHEMBL932206)
Ki 2.2±n/a nM
Citation Jones, LHRandall, ANapier, CTrevethick, MSreckovic, SWatson, J Design and synthesis of a fluorescent muscarinic antagonist. Bioorg Med Chem Lett18:825-7 (2008) 
 
Muscarinic acetylcholine receptor M5
Name:Muscarinic acetylcholine receptor M5
Type:PROTEIN
Mol. Mass.:60102.35
Organism:Homo sapiens (Human)
Description:ChEMBL_1517990
Residue:532
BDBM50165008
NameBDBM50165008
Synonyms:(+)-(R)-2-(alpha-(2-(Diisopropylamino)ethyl)benzyl)-p-cresol 2-[(1R)-3-(diisopropylamino)-1-phenylpropyl]-4-methylphenol TOLTERODINE
TypeSmall organic molecule
Emp. Form.C22H31NO
Mol. Mass.325.4876
SMILESCC(C)N(CC[C@H](c1ccccc1)c1cc(C)ccc1O)C(C)C