Reaction Details
TargetSerine/threonine-protein kinase Chk1
LigandBDBM50232238
Substrate/Competitorn/a
Meas. Tech.ChEMBL_468880 (CHEMBL949043)
IC50 102±n/a nM
Citation Smaill, JBLee, HHPalmer, BDThompson, AMSquire, CJBaker, ENBooth, RJKraker, AHook, KDenny, WA Synthesis and structure-activity relationships of soluble 8-substituted 4-(2-chlorophenyl)-9-hydroxypyrrolo[3,4-c]carbazole-1,3(2H,6H)-diones as inhibitors of the Wee1 and Chk1 checkpoint kinases. Bioorg Med Chem Lett18:929-33 (2008) 
 
Serine/threonine-protein kinase Chk1
Name:Serine/threonine-protein kinase Chk1
Type:Enzyme Catalytic Domain
Mol. Mass.:54443.02
Organism:Homo sapiens (Human)
Description:gi_166295192
Residue:476
BDBM50232238
NameBDBM50232238
Synonyms:4-(2-chlorophenyl)-8-(4-(dimethylamino)butyl)-9-hydroxy-6-methylpyrrolo[3,4-c]carbazole-1,3(2H,6H)-dione | CHEMBL255416
TypeSmall organic molecule
Emp. Form.C27H26ClN3O3
Mol. Mass.475.967
SMILESCN(C)CCCCc1cc2n(C)c3cc(c4C(=O)NC(=O)c4c3c2cc1O)-c1ccccc1Cl