Reaction Details
TargetSerine/threonine-protein kinase Chk1
LigandBDBM50232235
Substrate/Competitorn/a
Meas. Tech.ChEMBL_468880 (CHEMBL949043)
IC50 22±n/a nM
Citation Smaill, JBLee, HHPalmer, BDThompson, AMSquire, CJBaker, ENBooth, RJKraker, AHook, KDenny, WA Synthesis and structure-activity relationships of soluble 8-substituted 4-(2-chlorophenyl)-9-hydroxypyrrolo[3,4-c]carbazole-1,3(2H,6H)-diones as inhibitors of the Wee1 and Chk1 checkpoint kinases. Bioorg Med Chem Lett18:929-33 (2008) 
 
Serine/threonine-protein kinase Chk1
Name:Serine/threonine-protein kinase Chk1
Type:Enzyme Catalytic Domain
Mol. Mass.:54443.02
Organism:Homo sapiens (Human)
Description:gi_166295192
Residue:476
BDBM50232235
NameBDBM50232235
Synonyms:4-(2-chlorophenyl)-9-hydroxy-6-(2-hydroxyethyl)-8-(4-morpholinobutyl)pyrrolo[3,4-c]carbazole-1,3(2H,6H)-dione | CHEMBL258067
TypeSmall organic molecule
Emp. Form.C30H30ClN3O5
Mol. Mass.548.029
SMILESOCCn1c2cc(CCCCN3CCOCC3)c(O)cc2c2c3C(=O)NC(=O)c3c(cc12)-c1ccccc1Cl