Reaction Details
TargetSerine/threonine-protein kinase Chk1
LigandBDBM50374068
Substrate/Competitorn/a
Meas. Tech.ChEMBL_468880 (CHEMBL949043)
IC50 10±n/a nM
Citation Smaill, JBLee, HHPalmer, BDThompson, AMSquire, CJBaker, ENBooth, RJKraker, AHook, KDenny, WA Synthesis and structure-activity relationships of soluble 8-substituted 4-(2-chlorophenyl)-9-hydroxypyrrolo[3,4-c]carbazole-1,3(2H,6H)-diones as inhibitors of the Wee1 and Chk1 checkpoint kinases. Bioorg Med Chem Lett18:929-33 (2008) 
 
Serine/threonine-protein kinase Chk1
Name:Serine/threonine-protein kinase Chk1
Type:Enzyme Catalytic Domain
Mol. Mass.:54443.02
Organism:Homo sapiens (Human)
Description:gi_166295192
Residue:476
BDBM50374068
NameBDBM50374068
Synonyms:CHEMBL271071
TypeSmall organic molecule
Emp. Form.C27H24ClN3O4
Mol. Mass.489.95
SMILESOc1cc2c(cc1OCCCN1CCCC1)[nH]c1cc(c3C(=O)NC(=O)c3c21)-c1ccccc1Cl