Reaction Details
TargetSerine/threonine-protein kinase Chk1
LigandBDBM50232230
Substrate/Competitorn/a
Meas. Tech.ChEMBL_468880 (CHEMBL949043)
IC50 374±n/a nM
Citation Smaill, JBLee, HHPalmer, BDThompson, AMSquire, CJBaker, ENBooth, RJKraker, AHook, KDenny, WA Synthesis and structure-activity relationships of soluble 8-substituted 4-(2-chlorophenyl)-9-hydroxypyrrolo[3,4-c]carbazole-1,3(2H,6H)-diones as inhibitors of the Wee1 and Chk1 checkpoint kinases. Bioorg Med Chem Lett18:929-33 (2008) 
 
Serine/threonine-protein kinase Chk1
Name:Serine/threonine-protein kinase Chk1
Type:Enzyme Catalytic Domain
Mol. Mass.:54443.02
Organism:Homo sapiens (Human)
Description:gi_166295192
Residue:476
BDBM50232230
NameBDBM50232230
Synonyms:4-(2-chlorophenyl)-9-hydroxy-6-methyl-8-(3-morpholinopropoxy)pyrrolo[3,4-c]carbazole-1,3(2H,6H)-dione | CHEMBL272351
TypeSmall organic molecule
Emp. Form.C28H26ClN3O5
Mol. Mass.519.976
SMILESCn1c2cc(OCCCN3CCOCC3)c(O)cc2c2c3C(=O)NC(=O)c3c(cc12)-c1ccccc1Cl