Reaction Details
TargetWee1-like protein kinase
LigandBDBM50374069
Substrate/Competitorn/a
Meas. Tech.ChEMBL_468879 (CHEMBL949042)
IC50 24±n/a nM
Citation Smaill, JBLee, HHPalmer, BDThompson, AMSquire, CJBaker, ENBooth, RJKraker, AHook, KDenny, WA Synthesis and structure-activity relationships of soluble 8-substituted 4-(2-chlorophenyl)-9-hydroxypyrrolo[3,4-c]carbazole-1,3(2H,6H)-diones as inhibitors of the Wee1 and Chk1 checkpoint kinases. Bioorg Med Chem Lett18:929-33 (2008) 
 
Wee1-like protein kinase
Name:Wee1-like protein kinase
Type:PROTEIN
Mol. Mass.:71599.12
Organism:Homo sapiens (Human)
Description:ChEMBL_1445054
Residue:646
BDBM50374069
NameBDBM50374069
Synonyms:CHEMBL255565
TypeSmall organic molecule
Emp. Form.C30H30ClN3O4
Mol. Mass.532.03
SMILESOCCn1c2cc(CCCCN3CCCC3)c(O)cc2c2c3C(=O)NC(=O)c3c(cc12)-c1ccccc1Cl