Reaction Details
TargetWee1-like protein kinase
LigandBDBM50232237
Substrate/Competitorn/a
Meas. Tech.ChEMBL_468879 (CHEMBL949042)
IC50 30±n/a nM
Citation Smaill, JBLee, HHPalmer, BDThompson, AMSquire, CJBaker, ENBooth, RJKraker, AHook, KDenny, WA Synthesis and structure-activity relationships of soluble 8-substituted 4-(2-chlorophenyl)-9-hydroxypyrrolo[3,4-c]carbazole-1,3(2H,6H)-diones as inhibitors of the Wee1 and Chk1 checkpoint kinases. Bioorg Med Chem Lett18:929-33 (2008) 
 
Wee1-like protein kinase
Name:Wee1-like protein kinase
Type:PROTEIN
Mol. Mass.:71599.12
Organism:Homo sapiens (Human)
Description:ChEMBL_1445054
Residue:646
BDBM50232237
NameBDBM50232237
Synonyms:4-(2-chlorophenyl)-9-hydroxy-6-methyl-8-(4-morpholinobutyl)pyrrolo[3,4-c]carbazole-1,3(2H,6H)-dione | CHEMBL438566
TypeSmall organic molecule
Emp. Form.C29H28ClN3O4
Mol. Mass.518.003
SMILESCn1c2cc(CCCCN3CCOCC3)c(O)cc2c2c3C(=O)NC(=O)c3c(cc12)-c1ccccc1Cl