Reaction Details
TargetProtein kinase C beta type
LigandBDBM50374189
Substrate/Competitorn/a
Meas. Tech.ChEMBL_469035 (CHEMBL930944)
Ki 1100±n/a nM
Citation Sugimoto, TItagaki, KIrie, K Design and physicochemical properties of new fluorescent ligands of protein kinase C isozymes focused on CH/pi interaction. Bioorg Med Chem16:650-7 (2008) 
 
Protein kinase C beta type
Name:Protein kinase C beta type
Type:Enzyme
Mol. Mass.:76873.67
Organism:Homo sapiens (Human)
Description:The recombinant human PKC enzymes were produced using a baculovirus expression system in SF9 cells
Residue:671
BDBM50374189
NameBDBM50374189
Synonyms:CHEMBL441897
TypeSmall organic molecule
Emp. Form.C19H24N4O2
Mol. Mass.340.4195
SMILESCC(C)[C@@H]1N(C)c2ccc3c(C)nn4cc(C[C@@H](CO)NC1=O)c2c34