Reaction Details
TargetProtein kinase C alpha type
LigandBDBM50374190
Substrate/Competitorn/a
Meas. Tech.ChEMBL_469033 (CHEMBL930942)
Ki 86±n/a nM
Citation Sugimoto, TItagaki, KIrie, K Design and physicochemical properties of new fluorescent ligands of protein kinase C isozymes focused on CH/pi interaction. Bioorg Med Chem16:650-7 (2008) 
 
Protein kinase C alpha type
Name:Protein kinase C alpha type
Type:Enzyme
Mol. Mass.:76755.65
Organism:Homo sapiens (Human)
Description:The recombinant human PKC enzymes were produced using a baculovirus expression system in SF9 cells
Residue:672
BDBM50374190
NameBDBM50374190
Synonyms:CHEMBL271403
TypeSmall organic molecule
Emp. Form.C18H22N4O2
Mol. Mass.326.3929
SMILESCC(C)[C@@H]1N(C)c2ccc3cnn4cc(C[C@@H](CO)NC1=O)c2c34