Reaction Details
TargetProtein kinase C epsilon type
LigandBDBM50374191
Substrate/Competitorn/a
Meas. Tech.ChEMBL_469040 (CHEMBL929991)
Ki 80±n/a nM
Citation Sugimoto, TItagaki, KIrie, K Design and physicochemical properties of new fluorescent ligands of protein kinase C isozymes focused on CH/pi interaction. Bioorg Med Chem16:650-7 (2008) 
 
Protein kinase C epsilon type
Name:Protein kinase C epsilon type
Type:Enzyme
Mol. Mass.:83680.45
Organism:Homo sapiens (Human)
Description:The recombinant human PKC enzymes were produced using a baculovirus expression system in SF9 cells
Residue:737
BDBM50374191
NameBDBM50374191
Synonyms:CHEMBL261387
TypeSmall organic molecule
Emp. Form.C19H21F3N4O2
Mol. Mass.394.3908
SMILESCC(C)[C@@H]1N(C)c2ccc3c(nn4cc(C[C@@H](CO)NC1=O)c2c34)C(F)(F)F