Reaction Details
TargetMatrix metalloproteinase-9
LigandBDBM50374192
Substrate/Competitorn/a
Meas. Tech.ChEMBL_469152 (CHEMBL929071)
IC50 4±n/a nM
Citation Zhang, YMFan, XYang, SMScannevin, RHBurke, SLRhodes, KJJackson, PF Syntheses and in vitro evaluation of arylsulfone-based MMP inhibitors with heterocycle-derived zinc-binding groups (ZBGs). Bioorg Med Chem Lett18:405-8 (2008) 
 
Matrix metalloproteinase-9
Name:Matrix metalloproteinase-9
Type:Enzyme
Mol. Mass.:78452.28
Organism:Homo sapiens (Human)
Description:P14780
Residue:707
BDBM50374192
NameBDBM50374192
Synonyms:CHEMBL271866
TypeSmall organic molecule
Emp. Form.C19H14F3NO6S
Mol. Mass.441.378
SMILESOc1cccn(CS(=O)(=O)c2ccc(Oc3ccc(OC(F)(F)F)cc3)cc2)c1=O