Reaction Details
TargetProthrombin
LigandBDBM50118727
Substrate/Competitorn/a
Meas. Tech.ChEMBL_469216 (CHEMBL948917)
Ki 1.1±n/a nM
Citation Maryanoff, BECostanzo, MJ Inhibitors of proteases and amide hydrolases that employ an alpha-ketoheterocycle as a key enabling functionality. Bioorg Med Chem16:1562-95 (2008) 
 
Prothrombin
Name:Prothrombin
Type:Protein
Mol. Mass.:70029.57
Organism:Homo sapiens (Human)
Description:P00734
Residue:622
BDBM50118727
NameBDBM50118727
Synonyms:2-((R)-1-((S)-2-(((S)-7-amino-1-isopropoxy-1,2-dioxoheptan-3-yl)carbamoyl)pyrrolidin-1-yl)-3-cyclohexyl-1-oxopropan-2-ylamino)acetic acid CHEMBL139242
TypeSmall organic molecule
Emp. Form.C26H44N4O7
Mol. Mass.524.6502
SMILESCC(C)OC(=O)C(=O)[C@H](CCCCN)NC(=O)[C@@H]1CCCN1C(=O)[C@@H](CC1CCCCC1)NCC(O)=O