Reaction Details
TargetCathepsin B
LigandBDBM50374367
Substrate/Competitorn/a
Meas. Tech.ChEMBL_469264 (CHEMBL949946)
Ki 2±n/a nM
Citation Maryanoff, BECostanzo, MJ Inhibitors of proteases and amide hydrolases that employ an alpha-ketoheterocycle as a key enabling functionality. Bioorg Med Chem16:1562-95 (2008) 
 
Cathepsin B
Name:Cathepsin B
Type:Enzyme
Mol. Mass.:37819.69
Organism:Homo sapiens (Human)
Description:gi_63102437
Residue:339
BDBM50374367
NameBDBM50374367
Synonyms:CHEMBL271004
TypeSmall organic molecule
Emp. Form.C27H32N4O7
Mol. Mass.524.5656
SMILESCCCC[C@H](NC(=O)C(=O)[C@H](CC(C)C)NC(=O)OCc1ccccc1)C(=O)c1nnc(o1)-c1ccco1