Reaction Details
TargetFatty-acid amide hydrolase 1
LigandBDBM50161518
Substrate/Competitorn/a
Meas. Tech.ChEMBL_469284 (CHEMBL949129)
Ki 0.094±n/a nM
Citation Maryanoff, BECostanzo, MJ Inhibitors of proteases and amide hydrolases that employ an alpha-ketoheterocycle as a key enabling functionality. Bioorg Med Chem16:1562-95 (2008) 
 
Fatty-acid amide hydrolase 1
Name:Fatty-acid amide hydrolase 1
Type:Protein
Mol. Mass.:63071.19
Organism:Homo sapiens (Human)
Description:O00519
Residue:579
BDBM50161518
NameBDBM50161518
Synonyms:1-(oxazolo[4,5-b]pyridin-2-yl)-6-phenylhexan-1-one CHEMBL175854
TypeSmall organic molecule
Emp. Form.C18H18N2O2
Mol. Mass.294.3477
SMILESO=C(CCCCCc1ccccc1)c1nc2ncccc2o1