Reaction Details
TargetFatty-acid amide hydrolase 1 [30-579]
LigandBDBM50350547
Substrate/Competitorn/a
Meas. Tech.ChEMBL_469283 (CHEMBL949127)
Ki 0.57±n/a nM
Citation Maryanoff, BECostanzo, MJ Inhibitors of proteases and amide hydrolases that employ an alpha-ketoheterocycle as a key enabling functionality. Bioorg Med Chem16:1562-95 (2008) 
 
Fatty-acid amide hydrolase 1 [30-579]
Name:Fatty-acid amide hydrolase 1 [30-579]
Type:Single-pass membrane protein; homodimer
Mol. Mass.:60474.00
Organism:Rattus norvegicus (rat)
Description:P97612 (aa 30-579)
Residue:550
BDBM50350547
NameBDBM50350547
Synonyms:CHEMBL257307
TypeSmall organic molecule
Emp. Form.C18H26N2O2
Mol. Mass.302.4112
SMILESCCCCCCCCCCCC(=O)c1nc2ncccc2o1