Reaction Details
TargetFatty-acid amide hydrolase 1 [30-579]
LigandBDBM50161511
Substrate/Competitorn/a
Meas. Tech.ChEMBL_469283 (CHEMBL949127)
Ki 0.56±n/a nM
Citation Maryanoff, BECostanzo, MJ Inhibitors of proteases and amide hydrolases that employ an alpha-ketoheterocycle as a key enabling functionality. Bioorg Med Chem16:1562-95 (2008) 
 
Fatty-acid amide hydrolase 1 [30-579]
Name:Fatty-acid amide hydrolase 1 [30-579]
Type:Single-pass membrane protein; homodimer
Mol. Mass.:60474.00
Organism:Rattus norvegicus (rat)
Description:P97612 (aa 30-579)
Residue:550
BDBM50161511
NameBDBM50161511
Synonyms:1-(5-(Furan-2-yl)-1,3,4-oxadiazol-2-yl)-heptan-1-one 1-[5-(furan-2-yl)-1,3,4-oxadiazol-2-yl]-7-phenylheptan-1-one | CHEMBL426967
TypeSmall organic molecule
Emp. Form.C19H20N2O3
Mol. Mass.324.3737
SMILESO=C(CCCCCCc1ccccc1)c1nnc(o1)-c1ccco1