Reaction Details
TargetNeutrophil elastase
LigandBDBM50031203
Substrate/Competitorn/a
Meas. Tech.ChEMBL_469207 (CHEMBL932239)
Ki 0.1±n/a nM
Citation Maryanoff, BECostanzo, MJ Inhibitors of proteases and amide hydrolases that employ an alpha-ketoheterocycle as a key enabling functionality. Bioorg Med Chem16:1562-95 (2008) 
 
Neutrophil elastase
Name:Neutrophil elastase
Type:Enzyme
Mol. Mass.:28532.38
Organism:Homo sapiens (Human)
Description:P08246
Residue:267
BDBM50031203
NameBDBM50031203
Synonyms:2-{(S)-2-[((S)-1-{(S)-2-[4-(4-Chloro-benzenesulfonylaminocarbonyl)-benzoylamino]-3-methyl-butyryl}-pyrrolidine-2-carbonyl)-amino]-3-methyl-butyryl}-benzooxazole-6-carboxylic acid methyl ester methyl 2-((S)-2-((S)-1-((S)-2-(4-(carbamoyl)benzamido)-3-methylbutanoyl)pyrrolidine-2-carboxamido)-3-methylbutanoyl)benzo[d]oxazole-6-carboxylate
TypeSmall organic molecule
Emp. Form.C38H40ClN5O10S
Mol. Mass.794.27
SMILESCOC(=O)c1ccc2nc(oc2c1)C(=O)[C@@H](NC(=O)[C@@H]1CCCN1C(=O)[C@@H](NC(=O)c1ccc(cc1)C(=O)NS(=O)(=O)c1ccc(Cl)cc1)C(C)C)C(C)C