Reaction Details
TargetCathepsin K
LigandBDBM50374399
Substrate/Competitorn/a
Meas. Tech.ChEMBL_469263 (CHEMBL949945)
Ki 0.95±n/a nM
Citation Maryanoff, BECostanzo, MJ Inhibitors of proteases and amide hydrolases that employ an alpha-ketoheterocycle as a key enabling functionality. Bioorg Med Chem16:1562-95 (2008) 
 
Cathepsin K
Name:Cathepsin K
Type:Enzyme
Mol. Mass.:36975.68
Organism:Homo sapiens (Human)
Description:P43235
Residue:329
BDBM50374399
NameBDBM50374399
Synonyms:CHEMBL209293
TypeSmall organic molecule
Emp. Form.C27H33N5O5
Mol. Mass.507.5814
SMILESCCC[C@H](NC(=O)C1(CCCCC1)NC(=O)c1ccc(cc1)N(C)C)C(=O)c1nnc(o1)-c1ccco1