Reaction Details
TargetOrexin receptor type 2
LigandBDBM50232703
Substrate/Competitorn/a
Meas. Tech.ChEMBL_469337 (CHEMBL932891)
Ki 1±n/a nM
Citation Bergman, JMRoecker, AJMercer, SPBednar, RAReiss, DRRansom, RWMeacham Harrell, CPettibone, DJLemaire, WMurphy, KLLi, CPrueksaritanont, TWinrow, CJRenger, JJKoblan, KSHartman, GDColeman, PJ Proline bis-amides as potent dual orexin receptor antagonists. Bioorg Med Chem Lett18:1425-30 (2008) 
 
Orexin receptor type 2
Name:Orexin receptor type 2
Type:Protein
Mol. Mass.:50710.53
Organism:Homo sapiens (Human)
Description:O43614
Residue:444
BDBM50232703
NameBDBM50232703
Synonyms:(S)-1-(2-(1H-benzo[d]imidazol-2-ylthio)acetyl)-N-(2-(1H-pyrrol-1-yl)phenyl)pyrrolidine-2-carboxamide | CHEMBL403259
TypeSmall organic molecule
Emp. Form.C24H23N5O2S
Mol. Mass.445.537
SMILESO=C(CSc1nc2ccccc2[nH]1)N1CCC[C@H]1C(=O)Nc1ccccc1-n1cccc1