Reaction Details
TargetSigma non-opioid intracellular receptor 1
LigandBDBM50374598
Substrate/Competitorn/a
Meas. Tech.ChEMBL_469590 (CHEMBL934063)
Ki 1.28±n/a nM
Citation Mésangeau, CNarayanan, SGreen, AMShaikh, JKaushal, NViard, EXu, YTFishback, JAPoupaert, JHMatsumoto, RRMcCurdy, CR Conversion of a highly selective sigma-1 receptor-ligand to sigma-2 receptor preferring ligands with anticocaine activity. J Med Chem51:1482-6 (2008) 
 
Sigma non-opioid intracellular receptor 1
Name:Sigma non-opioid intracellular receptor 1
Type:Enzyme Catalytic Domain
Mol. Mass.:25266.54
Organism:RAT
Description:Q9R0C9
Residue:223
BDBM50374598
NameBDBM50374598
Synonyms:CHEMBL272603 US9724435, Compound CM-156
TypeSmall organic molecule
Emp. Form.C21H31N3S2
Mol. Mass.389.621
SMILESS=c1sc2ccccc2n1CCCCN1CCN(CC1)C1CCCCC1