Reaction Details
TargetD(2) dopamine receptor
LigandBDBM50374598
Substrate/Competitorn/a
Meas. Tech.ChEMBL_469598 (CHEMBL933157)
Ki 1041±n/a nM
Citation Mésangeau, CNarayanan, SGreen, AMShaikh, JKaushal, NViard, EXu, YTFishback, JAPoupaert, JHMatsumoto, RRMcCurdy, CR Conversion of a highly selective sigma-1 receptor-ligand to sigma-2 receptor preferring ligands with anticocaine activity. J Med Chem51:1482-6 (2008) 
 
D(2) dopamine receptor
Name:D(2) dopamine receptor
Type:G Protein-Coupled Receptor (GPCR)
Mol. Mass.:50931.60
Organism:Rattus norvegicus (rat)
Description:P61169
Residue:444
BDBM50374598
NameBDBM50374598
Synonyms:CHEMBL272603 US9724435, Compound CM-156
TypeSmall organic molecule
Emp. Form.C21H31N3S2
Mol. Mass.389.621
SMILESS=c1sc2ccccc2n1CCCCN1CCN(CC1)C1CCCCC1