Reaction Details
TargetKappa-type opioid receptor
LigandBDBM50374640
Substrate/Competitorn/a
Meas. Tech.ChEMBL_469676 (CHEMBL946804)
Ki 5.3±n/a nM
Citation Munro, TADuncan, KKXu, WWang, YLiu-Chen, LYCarlezon, WACohen, BMBéguin, C Standard protecting groups create potent and selective kappa opioids: salvinorin B alkoxymethyl ethers. Bioorg Med Chem16:1279-86 (2008) 
 
Kappa-type opioid receptor
Name:Kappa-type opioid receptor
Type:G Protein-Coupled Receptor (GPCR)
Mol. Mass.:42648.76
Organism:Homo sapiens (Human)
Description:P41145
Residue:380
BDBM50374640
NameBDBM50374640
Synonyms:CHEMBL255139
TypeSmall organic molecule
Emp. Form.C26H36O8
Mol. Mass.476.5592
SMILESCCCCOCO[C@H]1C[C@@H](C(=O)OC)[C@]2(C)CC[C@H]3C(=O)O[C@@H](C[C@]3(C)[C@H]2C1=O)c1ccoc1