Reaction Details
TargetMu-type opioid receptor
LigandBDBM50374638
Substrate/Competitorn/a
Meas. Tech.ChEMBL_469677 (CHEMBL946805)
Ki>1000±n/a nM
Citation Munro, TADuncan, KKXu, WWang, YLiu-Chen, LYCarlezon, WACohen, BMBéguin, C Standard protecting groups create potent and selective kappa opioids: salvinorin B alkoxymethyl ethers. Bioorg Med Chem16:1279-86 (2008) 
 
Mu-type opioid receptor
Name:Mu-type opioid receptor
Type:G Protein-Coupled Receptor (GPCR)
Mol. Mass.:44503.11
Organism:Rattus norvegicus (rat)
Description:Competition binding assays were carried out using membrane preparations from transfected HN9.10 cells that constitutively expressed the mu opioid receptor.
Residue:398
BDBM50374638
NameBDBM50374638
Synonyms:CHEMBL258285
TypeSmall organic molecule
Emp. Form.C25H34O8
Mol. Mass.462.5327
SMILESCCCOCO[C@H]1C[C@@H](C(=O)OC)[C@]2(C)CC[C@H]3C(=O)O[C@@H](C[C@]3(C)[C@H]2C1=O)c1ccoc1