Reaction Details
TargetKappa-type opioid receptor
LigandBDBM50374646
Substrate/Competitorn/a
Meas. Tech.ChEMBL_469679 (CHEMBL946807)
EC50 67±n/a nM
Citation Munro, TADuncan, KKXu, WWang, YLiu-Chen, LYCarlezon, WACohen, BMBéguin, C Standard protecting groups create potent and selective kappa opioids: salvinorin B alkoxymethyl ethers. Bioorg Med Chem16:1279-86 (2008) 
 
Kappa-type opioid receptor
Name:Kappa-type opioid receptor
Type:G Protein-Coupled Receptor (GPCR)
Mol. Mass.:42648.76
Organism:Homo sapiens (Human)
Description:P41145
Residue:380
BDBM50374646
NameBDBM50374646
Synonyms:CHEMBL255969
TypeSmall organic molecule
Emp. Form.C24H32O7
Mol. Mass.432.5067
SMILESCCCO[C@H]1C[C@@H](C(=O)OC)[C@]2(C)CC[C@H]3C(=O)O[C@@H](C[C@]3(C)[C@H]2C1=O)c1ccoc1