Reaction Details
TargetNitric oxide synthase, inducible
LigandBDBM50374674
Substrate/Competitorn/a
Meas. Tech.ChEMBL_469819 (CHEMBL933386)
Kd 10000±n/a nM
Citation Martin, NIBeeson, WTWoodward, JJMarletta, MA N(G)-aminoguanidines from primary amines and the preparation of nitric oxide synthase inhibitors. J Med Chem51:924-31 (2008) 
 
Nitric oxide synthase, inducible
Name:Nitric oxide synthase, inducible
Type:Homodimer
Mol. Mass.:131141.95
Organism:Homo sapiens (Human)
Description:P35228
Residue:1153
BDBM50374674
NameBDBM50374674
Synonyms:CHEMBL408756
TypeSmall organic molecule
Emp. Form.C7H17N5O2
Mol. Mass.203.2422
SMILESCN(N)C(=N)NCCC[C@H](N)C(O)=O