Reaction Details
TargetMAP kinase-activated protein kinase 2
LigandBDBM50374688
Substrate/Competitorn/a
Meas. Tech.ChEMBL_469831 (CHEMBL949020)
IC50 4±n/a nM
Citation Goldberg, DRChoi, YCogan, DCorson, MDeLeon, RGao, AGruenbaum, LHao, MHJoseph, DKashem, MAMiller, CMoss, NNetherton, MRPargellis, CPPelletier, JSellati, RSkow, DTorcellini, CTseng, YCWang, JWasti, RWerneburg, BWu, JPXiong, Z Pyrazinoindolone inhibitors of MAPKAP-K2. Bioorg Med Chem Lett18:938-41 (2008) 
 
MAP kinase-activated protein kinase 2
Name:MAP kinase-activated protein kinase 2
Type:Serine/threonine-protein kinase
Mol. Mass.:45579.87
Organism:Homo sapiens (Human)
Description:P49137
Residue:400
BDBM50374688
NameBDBM50374688
Synonyms:CHEMBL255991
TypeSmall organic molecule
Emp. Form.C26H32N6O3S
Mol. Mass.508.636
SMILESCC(C)CN1CCC(CC1)NC(=O)c1csc(NC(=O)c2ccc3cc4C(=O)NCC(C)n4c3c2)n1