Reaction Details
TargetMitogen-activated protein kinase 1
LigandBDBM50374681
Substrate/Competitorn/a
Meas. Tech.ChEMBL_469834 (CHEMBL949019)
IC50>3000±n/a nM
Citation Goldberg, DRChoi, YCogan, DCorson, MDeLeon, RGao, AGruenbaum, LHao, MHJoseph, DKashem, MAMiller, CMoss, NNetherton, MRPargellis, CPPelletier, JSellati, RSkow, DTorcellini, CTseng, YCWang, JWasti, RWerneburg, BWu, JPXiong, Z Pyrazinoindolone inhibitors of MAPKAP-K2. Bioorg Med Chem Lett18:938-41 (2008) 
 
Mitogen-activated protein kinase 1
Name:Mitogen-activated protein kinase 1
Type:Ser/Thr Protein Kinase
Mol. Mass.:41392.76
Organism:Homo sapiens (Human)
Description:P28482
Residue:360
BDBM50374681
NameBDBM50374681
Synonyms:CHEMBL257834
TypeSmall organic molecule
Emp. Form.C29H36N6O3S
Mol. Mass.548.7
SMILESCC(C)(C)CN1CCC(CC1)NC(=O)c1csc(NC(=O)c2ccc3cc4C(=O)NCC5(CCC5)n4c3c2)n1