Reaction Details
TargetATP-dependent translocase ABCB1
LigandBDBM50374730
Substrate/Competitorn/a
Meas. Tech.ChEMBL_469905 (CHEMBL921229)
EC50 8200±n/a nM
Citation Colabufo, NABerardi, FCantore, MPerrone, MGContino, MInglese, CNiso, MPerrone, RAzzariti, ASimone, GMPorcelli, LParadiso, A Small P-gp modulating molecules: SAR studies on tetrahydroisoquinoline derivatives. Bioorg Med Chem16:362-73 (2008) 
 
ATP-dependent translocase ABCB1
Name:ATP-dependent translocase ABCB1
Type:Protein
Mol. Mass.:141503.50
Organism:Homo sapiens (Human)
Description:P08183
Residue:1280
BDBM50374730
NameBDBM50374730
Synonyms:CHEMBL264424
TypeSmall organic molecule
Emp. Form.C19H27NO
Mol. Mass.285.4238
SMILESCOc1cccc2\C(CCCc12)=C\CCN1CCCCC1