Reaction Details
TargetATP-dependent translocase ABCB1
LigandBDBM50374731
Substrate/Competitorn/a
Meas. Tech.ChEMBL_469905 (CHEMBL921229)
EC50 1640±n/a nM
Citation Colabufo, NABerardi, FCantore, MPerrone, MGContino, MInglese, CNiso, MPerrone, RAzzariti, ASimone, GMPorcelli, LParadiso, A Small P-gp modulating molecules: SAR studies on tetrahydroisoquinoline derivatives. Bioorg Med Chem16:362-73 (2008) 
 
ATP-dependent translocase ABCB1
Name:ATP-dependent translocase ABCB1
Type:Protein
Mol. Mass.:141503.50
Organism:Homo sapiens (Human)
Description:P08183
Residue:1280
BDBM50374731
NameBDBM50374731
Synonyms:CHEMBL260599
TypeSmall organic molecule
Emp. Form.C25H31NO3
Mol. Mass.393.5185
SMILESCOc1cc2CCN(CC\C=C3/CCCc4c(OC)cccc34)Cc2cc1OC