Reaction Details
TargetIntegrin alpha-4/beta-7
LigandBDBM50374926
Substrate/Competitorn/a
Meas. Tech.ChEMBL_470070 (CHEMBL933448)
IC50 1600±n/a nM
Citation Harriman, GCBrewer, MBennett, RKuhn, CBazin, MLarosa, GSkerker, PCochran, NGallant, DBaxter, DPicarella, DJaffee, BLuly, JRBriskin, MJ Selective cell adhesion inhibitors: Barbituric acid based alpha4beta7--MAdCAM inhibitors. Bioorg Med Chem Lett18:2509-12 (2008) 
 
Integrin alpha-4/beta-7
Name:Integrin alpha-4/beta-7
Type:Protein Complex
Mol. Mass.:n/a
Description:The assay uses stably transfected K562 cells expressing human alpha4beta7 integrin.
Components:This complex has 2 components.
Component 1
Name:Integrin alpha-4
Synonyms:CD49 antigen-like family member D CD49d antigen ITA4_HUMAN Integrin alpha-4 Integrin alpha-IV VLA-4 integrin alpha 4 precursor | integrin alpha-4 precursor
Type:Membrane Protein
Mol. Mass.:114897.35
Organism:Homo sapiens (Human)
Description:P13612
Residue:1032
Component 2
Name:Integrin beta-7
Synonyms:ITB7_HUMAN Integrin alpha-4/beta-7 Integrin beta7
Type:Membrane Protein
Mol. Mass.:86893.88
Organism:Homo sapiens (Human)
Description:P26010
Residue:798
BDBM50374926
NameBDBM50374926
Synonyms:CHEMBL272366
TypeSmall organic molecule
Emp. Form.C17H10Cl2N2O3
Mol. Mass.361.179
SMILESClc1cc(Cl)cc(c1)N1C(=O)NC(=O)\C(=C\c2ccccc2)C1=O