Reaction Details
TargetIntegrin alpha-5/beta-1
LigandBDBM50374935
Substrate/Competitorn/a
Meas. Tech.ChEMBL_470072 (CHEMBL933450)
IC50>20000±n/a nM
Citation Harriman, GCBrewer, MBennett, RKuhn, CBazin, MLarosa, GSkerker, PCochran, NGallant, DBaxter, DPicarella, DJaffee, BLuly, JRBriskin, MJ Selective cell adhesion inhibitors: Barbituric acid based alpha4beta7--MAdCAM inhibitors. Bioorg Med Chem Lett18:2509-12 (2008) 
 
Integrin alpha-5/beta-1
Name:Integrin alpha-5/beta-1
Type:Enzyme
Mol. Mass.:n/a
Description:n/a
Components:This complex has 2 components.
Component 1
Name:Integrin alpha-5
Synonyms:CD49 antigen-like family member E FNRA Fibronectin receptor subunit alpha ITGA5 Integrin alpha-F | VLA-5
Type:Single-pass type I membrane protein
Mol. Mass.:114523.00
Organism:Homo sapiens (Human)
Description:n/a
Residue:1049
Component 2
Name:Integrin beta-1
Synonyms:CD_antigen=CD29 Fibronectin receptor beta GPIIA ITGB1 MDF2 | MSK12
Type:Enzyme
Mol. Mass.:88400.38
Organism:Homo sapiens (Human)
Description:P05556
Residue:798
BDBM50374935
NameBDBM50374935
Synonyms:CHEMBL271052
TypeSmall organic molecule
Emp. Form.C15H10N2O4
Mol. Mass.282.2509
SMILESO=C1NC(=O)\C(=C\c2ccco2)C(=O)N1c1ccccc1