Reaction Details
TargetMethionine aminopeptidase 1
LigandBDBM50375186
Substrate/Competitorn/a
Meas. Tech.ChEMBL_470290 (CHEMBL951176)
Ki>100000±n/a nM
Citation Haldar, MKScott, MDSule, NSrivastava, DKMallik, S Synthesis of barbiturate-based methionine aminopeptidase-1 inhibitors. Bioorg Med Chem Lett18:2373-6 (2008) 
 
Methionine aminopeptidase 1
Name:Methionine aminopeptidase 1
Type:Enzyme
Mol. Mass.:43220.79
Organism:Homo sapiens (Human)
Description:MetAP1 with an N-terminal six histidine tag was expressed in baculovirus infected sf9 cells.
Residue:386
BDBM50375186
NameBDBM50375186
Synonyms:CHEMBL273177
TypeSmall organic molecule
Emp. Form.C13H12N2O4
Mol. Mass.260.2454
SMILES[#6]-[#7]-1-[#6](=O)-[#7](-[#6])-[#6](=O)\[#6](=[#6]/c2ccc(-[#8])cc2)-[#6]-1=O