Reaction Details
TargetD(1A) dopamine receptor
LigandBDBM50375219
Substrate/Competitorn/a
Meas. Tech.ChEMBL_470456 (CHEMBL932683)
Ki 1422±n/a nM
Citation Ma, ZXu, WLiu-Chen, LYLee, DY Novel coumarin glycoside and phenethyl vanillate from Notopterygium forbesii and their binding affinities for opioid and dopamine receptors. Bioorg Med Chem16:3218-23 (2008) 
 
D(1A) dopamine receptor
Name:D(1A) dopamine receptor
Type:Enzyme Catalytic Domain
Mol. Mass.:49429.75
Organism:RAT
Description:P18901
Residue:446
BDBM50375219
NameBDBM50375219
Synonyms:CHEMBL258939
TypeSmall organic molecule
Emp. Form.C21H22O5
Mol. Mass.354.3964
SMILES[#6]\[#6](-[#6])=[#6]\[#6](-[#8])-[#6]\[#6](-[#6])=[#6]\[#6]-[#8]-c1c2ccoc2cc2oc(=O)ccc12