Reaction Details
TargetRAF proto-oncogene serine/threonine-protein kinase
LigandBDBM50237710
Substrate/Competitorn/a
Meas. Tech.ChEMBL_470479 (CHEMBL951323)
IC50 1100±n/a nM
Citation Zhu, TJiao, YChen, YDWang, XLi, HFZhang, LYLu, T Pharmacophore identification of Raf-1 kinase inhibitors. Bioorg Med Chem Lett18:2346-50 (2008) 
 
RAF proto-oncogene serine/threonine-protein kinase
Name:RAF proto-oncogene serine/threonine-protein kinase
Type:Serine/threonine-protein kinase
Mol. Mass.:73082.52
Organism:Homo sapiens (Human)
Description:P04049
Residue:648
BDBM50237710
NameBDBM50237710
Synonyms:4-methyl-N-[3-(4-methyl-1H-imidazol-1-yl)-5-(trifluoromethyl)phenyl]-3-[(4-pyridin-3-ylpyrimidin-2-yl)amino]benzamide AMN107 NILOTINIB | US11649218, Example Nilotinib
TypeSmall organic molecule
Emp. Form.C28H22F3N7O
Mol. Mass.529.5158
SMILESCc1cn(cn1)-c1cc(NC(=O)c2ccc(C)c(Nc3nccc(n3)-c3cccnc3)c2)cc(c1)C(F)(F)F