Reaction Details
TargetDelta-type opioid receptor
LigandBDBM50179191
Substrate/Competitorn/a
Meas. Tech.ChEMBL_470715 (CHEMBL934556)
IC50 0.94±n/a nM
Citation Salvadori, SFiorini, STrapella, CPorreca, FDavis, PSasaki, YAmbo, AMarczak, EDLazarus, LHBalboni, G Role of benzimidazole (Bid) in the delta-opioid agonist pseudopeptide H-Dmt-Tic-NH-CH(2)-Bid (UFP-502). Bioorg Med Chem16:3032-8 (2008) 
 
Delta-type opioid receptor
Name:Delta-type opioid receptor
Type:Enzyme Catalytic Domain
Mol. Mass.:40577.25
Organism:MOUSE
Description:P32300
Residue:372
BDBM50179191
NameBDBM50179191
Synonyms:(S)-N-((1H-benzo[d]imidazol-2-yl)methyl)-2-((S)-2-amino-3-(4-hydroxy-2,6-dimethylphenyl)propanoyl)-1,2,3,4-tetrahydroisoquinoline-3-carboxamide CHEMBL109390 UFP-502
TypeSmall organic molecule
Emp. Form.C29H31N5O3
Mol. Mass.497.5881
SMILESCc1cc(O)cc(C)c1C[C@H](N)C(=O)N1Cc2ccccc2C[C@H]1C(=O)NCc1nc2ccccc2[nH]1