Reaction Details
TargetLanosterol 14-alpha demethylase
LigandBDBM50375305
Substrate/Competitorn/a
Meas. Tech.ChEMBL_470779 (CHEMBL934981)
IC50>10000±n/a nM
Citation Ekins, SMankowski, DCHoover, DJLawton, MPTreadway, JLHarwood, HJ Three-dimensional quantitative structure-activity relationship analysis of human CYP51 inhibitors. Drug Metab Dispos35:493-500 (2007) 
 
Lanosterol 14-alpha demethylase
Name:Lanosterol 14-alpha demethylase
Type:Protein
Mol. Mass.:56817.21
Organism:Homo sapiens (Human)
Description:Q16850
Residue:509
BDBM50375305
NameBDBM50375305
Synonyms:AZACONAZOLE
TypeSmall organic molecule
Emp. Form.C12H11Cl2N3O2
Mol. Mass.300.141
SMILESClc1ccc(c(Cl)c1)C1(Cn2cncn2)OCCO1