Reaction Details
TargetLanosterol 14-alpha demethylase
LigandBDBM50375315
Substrate/Competitorn/a
Meas. Tech.ChEMBL_470779 (CHEMBL934981)
IC50 4500±n/a nM
Citation Ekins, SMankowski, DCHoover, DJLawton, MPTreadway, JLHarwood, HJ Three-dimensional quantitative structure-activity relationship analysis of human CYP51 inhibitors. Drug Metab Dispos35:493-500 (2007) 
 
Lanosterol 14-alpha demethylase
Name:Lanosterol 14-alpha demethylase
Type:Protein
Mol. Mass.:56817.21
Organism:Homo sapiens (Human)
Description:Q16850
Residue:509
BDBM50375315
NameBDBM50375315
Synonyms:CHEMBL265700
TypeSmall organic molecule
Emp. Form.C24H26ClN3O4
Mol. Mass.455.934
SMILESCOc1ccc(C[C@H](NC(=O)c2cc3cc(Cl)ccc3[nH]2)C(=O)N2CCC(O)CC2)cc1