Reaction Details
TargetSolute carrier family 22 member 5
LigandBDBM50375326
Substrate/Competitorn/a
Meas. Tech.ChEMBL_471112 (CHEMBL921265)
IC50 76000±n/a nM
Citation Piermatti, OFringuelli, FPochini, LIndiveri, CPalmerini, CA Synthesis and characterization of carnitine nitro-derivatives. Bioorg Med Chem16:1444-51 (2008) 
 
Solute carrier family 22 member 5
Name:Solute carrier family 22 member 5
Type:PROTEIN
Mol. Mass.:62570.99
Organism:Rattus norvegicus
Description:ChEMBL_471112
Residue:557
BDBM50375326
NameBDBM50375326
Synonyms:CHEMBL260616
TypeSmall organic molecule
Emp. Form.C13H25N2O7
Mol. Mass.321.3463
SMILESC[N+](C)(C)C[C@H](CC(O)=O)OC(=O)CCCCCO[N+]([O-])=O